Tracking #,Date,Donor Name,Donor Address,Email,Designation,Dedication,Source,Page Creator,Repeats,Payment Method,Origin,Refund,Team Name,Amount
603488,2/16/2012,Ellen Bob,"3296 Emerson Street, Palo Alto, CA 94306",esbob@aol.com,General Fund,in honor of JoEllen Kaiser,The Media Consortium,Jo Ellen Kaiser,,Credit Card,Razoo Sites,,,$25.00 
603323,2/15/2012,Jody Green,"5505 Durbin Road, Bethesda, MD 20814",greenmax5505@gmail.com,General Fund,,The Media Consortium,Jo Ellen Kaiser,,Credit Card,Razoo Sites,,,$100.00 
603034,2/15/2012,Marcia Jarmel,"663 7th Avenue, San Francisco, CA 94118",marcia@patchworksfilms.net,General Fund,,The Media Consortium,Jo Ellen Kaiser,,Credit Card,Razoo Sites,,,$25.00 
602721,2/15/2012,richard respler,"165 Daniel Low Terrace, Staten Island, NY 10301",rich.respler@yahoo.com,General Fund,,The Media Consortium,Jo Ellen Kaiser,,Credit Card,Razoo Sites,,,$10.00 
602341,2/15/2012,Brady M Swenson,"621 Lyon St., Lawrence, KS 66044",bradyswenson@gmail.com,General Fund,,The Media Consortium,Jo Ellen Kaiser,,Credit Card,Razoo Sites,,,$10.00 
602339,2/15/2012,Michael Tyler,"723 Bay Street, San Francisco, CA 94109",MichaelTyler@msn.com,General Fund,,The Media Consortium,Jo Ellen Kaiser,,Credit Card,Razoo Sites,,,$25.00 
601958,2/15/2012,Gary King,"Dept# 2221412, Sioux Falls, SD 57186",king@harvard.edu,General Fund,,The Media Consortium,Jo Ellen Kaiser,,Credit Card,Razoo Sites,,,$25.00 
601845,2/15/2012,Vincent W Stehle,"200 West Washington Square #3006, Philadelphia, PA 19106",vincentstehle@gmail.com,General Fund,,The Media Consortium,Jo Ellen Kaiser,,Credit Card,Razoo Sites,,,$100.00 
601801,2/15/2012,Daniel J Matthews Jr,"1081 Katie Lane, Watkinsville, GA 30677",danmatt@hotmail.com,General Fund,,The Media Consortium,Jo Ellen Kaiser,,Credit Card,Razoo Sites,,,$10.00 
601642,2/15/2012,ANDREW BOUCHIER,"114-140 Mann Avenue, Ottawa, Ontario K1N 1E5",saxfanatic@yahoo.com,General Fund,,The Media Consortium,Jo Ellen Kaiser,,Credit Card,Razoo Sites,,,$25.00 
601592,2/15/2012,susan l. lubeck,"3846 canon avenue, oakland, CA 94602",susan@susanlubeck.com,General Fund,,The Media Consortium,Jo Ellen Kaiser,,Credit Card,Razoo Sites,,,$36.00 
